{"text_format":"1","workbook":"xlsx","n_sheets":15,"sheets":["PRESENTACIÓN","INICIO","GEOMETRIA DEL MURO","PROPIEDADES DE LOS SUELOS","PROPIEDADES DEL GEOSINTETICO","CARGAS DISTRIBUIDAS","CARGAS CONCENTRADAS","MC ANALISIS EXTERNO","MC ANALISIS INTERNO","REVISION","DISEÑO","DISEÑO POR SISMO","DISEÑO FINAL","REPORTE FINAL","DISEÑO ALTERNATIVO"],"not_rendered":{"charts":0,"images":18,"macros":1,"external_links":0,"defined_names":16,"comments":0,"pivot_tables":0},"unopened":[],"bounds":{"document_bytes":16777216,"sheet_cells":100000,"rows_first":2000,"rows_last":500,"rows_between":2000,"halvings":0,"cell_chars":16384,"cell_head_chars":4096},"cells_cut":0,"cells_raw":0,"read":"whole","date_system":"1900"}

{"sheet":"PRESENTACIÓN","index":0,"n_rows":20,"n_cols":10,"rows_kept":20,"cut":false,"hidden":false,"merged":[[19,9,22,16],[14,9,15,16],[17,9,18,16],[7,9,7,16],[8,9,8,16],[9,9,9,16],[10,9,10,16],[11,9,11,16],[12,9,12,16]]}
[]
[]
[]
[]
[]
[]
[]
[null,null,null,null,null,null,null,null,null,"INSTITUTO MEXICANO DEL TRANSPORTE"]
[null,null,null,null,null,null,null,null,null," IMT"]
[null,null,null,null,null,null,null,null,null,"INTERNATIONAL GEOSYNTHETICS SOCIETY  "]
[null,null,null,null,null,null,null,null,null," IGS CAPITULO MEXICO"]
[null,null,null,null,null,null,null,null,null,"UNIVERSIDAD AUTONOMA DE CHIHUAHUA"]
[null,null,null,null,null,null,null,null,null,"UACH "]
[]
[null,null,null,null,null,null,null,null,null,"METODOLOGÍA PARA DISEÑOS DE MUROS MECÁNICAMENTE ESTABILIZADOS CON GEOSINTÉTICOS"]
[]
[]
[null,null,null,null,null,null,null,null,null,"MUROS CON RELLENOS HORIZONTALES"]
[]
[null,null,null,null,null,null,null,null,null,"Esta metodología esta basada en la publicación No. FHWA-NHI-00-043 “Mechanically Stabilized Earth Walls and Reinforced Soil Slopes, Design & Construction Guidelines”, del Departamento de Transporte de la Federal Highway Administration(FHWA) en los Estados Unidos de América, los valores requeridos para la realización de este diseño están mencionados en la parte teórica de este manual."]

{"sheet":"INICIO","index":1,"n_rows":11,"n_cols":5,"rows_kept":11,"cut":false,"hidden":false,"merged":[[0,2,1,8],[2,2,3,8],[10,4,11,8]]}
[null,null,"METODOLOGÍA PARA DISEÑOS DE MUROS MECANICAMENTE ESTABILIZADOS"]
[]
[null,null,"MUROS CON RELLENOS HORIZONTALES"]
[]
[]
[]
[]
[]
[]
[]
[null,null,null,null,"MENU DE INICIO"]

{"sheet":"GEOMETRIA DEL MURO","index":2,"n_rows":18,"n_cols":8,"rows_kept":18,"cut":false,"hidden":false,"merged":[[0,7,1,13],[2,7,3,13],[25,2,28,9],[16,2,16,9]]}
[null,null,null,null,null,null,null,"METODOLOGÍA PARA DISEÑOS DE MUROS MECANICAMENTE ESTABILIZADOS"]
[]
[null,null,null,null,null,null,null,"MUROS CON RELLENOS HORIZONTALES"]
[]
[]
[]
[]
["a) Geometría del Muro Mecánicamente Estabilizado."]
[]
[null,null,null,null,"H =",3.73,"m"]
[]
[null,null,null,null,"L =",4.3,"m"]
[]
[null,null,null,null,"Er:",0.5,"m"]
[]
[null,null,null,null,"Θ=",90,"°"]
[]
[null,null,null,null,"β =",0,"°"]

{"sheet":"PROPIEDADES DE LOS SUELOS","index":3,"n_rows":26,"n_cols":4,"rows_kept":26,"cut":false,"hidden":false,"merged":[[0,2,1,8],[2,2,3,8]]}
[null,null,"METODOLOGÍA PARA DISEÑOS DE MUROS MECANICAMENTE ESTABILIZADOS"]
[]
[null,null,"MUROS CON RELLENOS HORIZONTALES"]
[]
[]
[]
[]
[]
[]
[]
["c) Propiedades de los suelos."]
[]
[null,"Suelo de cimentación o de desplante:"]
[null,"gc =",16.43,"KN/m3"]
[null,"Cc =",99,"KN/m2"]
[null,"ϕc =",28,"°"]
[]
[null,"Relleno retenido:"]
[null,"gf =",18,"KN/m3"]
[null,"Cf =",10,"KN/m2"]
[null,"ϕf =",30,"°"]
[]
[null,"Masa de suelo reforzado:"]
[null,"gr =",18,"KN/m3"]
[null,"Cr =",10,"KN/m2"]
[null,"ϕr =",30,"°"]

{"sheet":"PROPIEDADES DEL GEOSINTETICO","index":4,"n_rows":30,"n_cols":5,"rows_kept":30,"cut":false,"hidden":false,"merged":[[16,3,16,6],[0,2,1,8],[2,2,3,8]]}
[null,null,"METODOLOGÍA PARA DISEÑOS DE MUROS MECANICAMENTE ESTABILIZADOS"]
[]
[null,null,"MUROS CON RELLENOS HORIZONTALES"]
[]
[]
[]
[]
[]
[]
[]
["d) Propiedades del Geosintético."]
[]
["C =",2]
[]
["Ci =",0.66]
["Zi =","Profundidad a la que se encuentra el refuerzo"]
[null,null,null,"Relación de cobertura."]
[null,"si: "]
[null,null,"b =",1,"m"]
[null,2]
[null,null,"Sh =",1,"m"]
["Rc =",1]
[]
[]
["α =",{"$f":"IF(C25=\"Geotextil\",0.6,IF(C25=\"Geomalla\",0.8,0))","v":0.8},"Geomalla"]
[]
[]
["d.1) Coeficiente de fricción de la interacción Suelo/Refuerzo."]
[]
["r =",null,"°"]
{"$rows_left_out":1}
{"sheet":"CARGAS DISTRIBUIDAS","index":5,"n_rows":39,"n_cols":3,"rows_kept":39,"cut":false,"hidden":false,"merged":[[0,2,1,8],[2,2,3,8],[36,0,36,1]]}
[null,null,"METODOLOGÍA PARA DISEÑOS DE MUROS MECANICAMENTE ESTABILIZADOS"]
[]
[null,null,"MUROS CON RELLENOS HORIZONTALES"]
[]
[]
[]
[]
[]
[]
[]
["b) Cargas aplicadas en el Muro Mecánicamente Estabilizado."]
[]
["q(Carga distribuida) = ",25,"KN/m · m"]
[]
[]
[]
[]
[]
[]
[]
[]
[]
[]
[]
[]
[]
[]
[]
[]
[]
{"$rows_left_out":10}
{"sheet":"CARGAS CONCENTRADAS","index":6,"n_rows":59,"n_cols":7,"rows_kept":59,"cut":false,"hidden":false,"merged":[[42,6,43,13],[12,6,12,11],[0,6,1,12],[2,6,3,12],[10,5,11,12]]}
[null,null,null,null,null,null,"METODOLOGÍA PARA DISEÑOS DE MUROS MECANICAMENTE ESTABILIZADOS"]
[]
[null,null,null,null,null,null,"MUROS CON RELLENOS HORIZONTALES"]
[]
[]
[]
[]
[]
[]
[]
[null,null,null,null,null,"INCREMENTO DE ESFUERZO HORIZONTAL POR CARGAS CONCENTRADAS"]
[]
[]
[]
[]
[]
["DATOS:"]
["Ph1 =",0,"KN/m"]
["Pv1 = ",0,"KN/m"]
["a = ",0,"m"]
["g = ",0,"KN/m3","Peso especifico del relleno que retiene la estructura especial."]
["ϕ =",0,"°","Coeficiente de friccion de el suelo que retiene la estructura especial."]
["Ka =",{"$f":"(TAN(RADIANS(45-(B22/2))))^2","v":0.99999999999999978}]
["q =",{"$f":"'CARGAS DISTRIBUIDAS'!B13","v":25},"KN/m · m"]
["F1 =",{"$f":"0.5*(B23*B21*B20^2)","v":0},"KN/m"]
[null,null,null,null,"Ubicación de F1 con respecto a la parte superior del muro =",{"$f":"(1/3)*B20","v":0},"m"]
["F2 =",{"$f":"B24*B23*B20","v":0},"KN/m"]
[null,null,null,null,"Ubicación de F2 con respecto a la parte superior del muro =",{"$f":"0.5*B20","v":0},"m"]
["Cf =",0,"m"]
["bf =",0,"m"]
{"$rows_left_out":30}
{"sheet":"MC ANALISIS EXTERNO","index":7,"n_rows":235,"n_cols":6,"rows_kept":235,"cut":false,"hidden":false,"merged":[[234,5,236,9],[34,0,34,9],[0,2,1,8],[2,2,3,8],[11,4,11,7],[10,3,10,8],[187,5,189,9],[191,2,191,7],[192,2,192,7],[105,2,105,7],[106,3,106,6],[206,4,207,11],[208,0,209,11],[226,5,228,9]]}
[null,null,"METODOLOGÍA PARA DISEÑOS DE MUROS MECANICAMENTE ESTABILIZADOS"]
[]
[null,null,"MUROS CON RELLENOS HORIZONTALES"]
[]
[]
[]
[]
[]
[]
[]
[null,null,null,"ANÁLISIS EXTERNO DE LA ESTRUCTURA"]
[null,null,null,null,"FUERZAS HORIZONTALES"]
["a) Se obtiene los diagramas de presiones que actuan en el muro:"]
[]
[]
[]
[]
[]
[]
[]
[]
[]
[]
[]
[]
[]
[]
[]
[]
[]
{"$rows_left_out":206}
{"sheet":"MC ANALISIS INTERNO","index":8,"n_rows":132,"n_cols":20,"rows_kept":132,"cut":false,"hidden":false,"merged":[[18,16,18,19],[91,4,93,12],[0,3,1,9],[2,3,3,9],[10,4,10,9],[45,5,47,9],[11,4,11,9]]}
[null,null,null,"METODOLOGÍA PARA DISEÑOS DE MUROS MECANICAMENTE ESTABILIZADOS"]
[]
[null,null,null,"MUROS CON RELLENOS HORIZONTALES"]
[]
[]
[]
[]
[]
[]
[]
[null,null,null,null,"ANÁLISIS INTERNO DE LA ESTRUCTURA"]
[null,null,null,null,"CARGAS ADMISIBLES"]
[]
["a) Esfuerzo máximo vertical."]
[]
[]
[]
[null,null,"σv = ",{"$f":"IF(('MC ANALISIS EXTERNO'!E125-(2*'MC ANALISIS EXTERNO'!D182))=0,0,(('MC ANALISIS EXTERNO'!D132+'MC ANALISIS EXTERNO'!D144)/('MC ANALISIS EXTERNO'!E125-(2*'MC ANALISIS EXTERNO'!D182)))+'CARGAS CONCENTRADAS'!D59)","v":117.44673987075213},"KN/m2"]
[null,null,null,null,null,null,null,null,null,null,null,null,null,null,null,null,"FACTORES DE CAPACIDAD DE CARGA"]
["b) Carga última.",null,null,null,null,null,null,null,null,null,null,null,null,null,null,null,"j","Nc","Nq","Ng"]
[null,null,null,null,null,null,null,null,null,null,null,null,null,null,null,null,0,5.14,1,0]
[null,null,null,null,null,null,null,null,null,null,null,null,null,null,null,null,1,5.38,1.0900000000000001,7.0000000000000007E-2]
[null,null,null,null,null,null,null,null,null,null,null,null,null,null,null,null,2,5.63,1.2,0.15]
[null,"si =","ϕc =",{"$f":"'PROPIEDADES DE LOS SUELOS'!C16","v":28},"°",null,null,null,null,null,null,null,null,null,null,null,3,5.9,1.31,0.24]
[null,null,null,null,null,null,null,null,null,null,null,null,null,null,null,null,4,6.19,1.43,0.34]
[null,"Tenemos los factores de capacidad de carga de:",null,null,null,null,null,null,null,null,null,null,null,null,null,null,5,6.49,1.57,0.45]
[null,null,null,null,null,null,null,null,null,null,null,null,null,null,null,null,6,6.81,1.72,0.56999999999999995]
[null,null,"Nc =",{"$f":"VLOOKUP(D24,Q21:T68,2,TRUE)","v":25.8},null,null,null,null,null,null,null,null,null,null,null,null,7,7.16,1.88,0.71]
[null,null,"Nq = ",{"$f":"VLOOKUP(D24,'MC ANALISIS INTERNO'!Q21:T68,3,TRUE)","v":14.72},null,null,null,null,null,null,null,null,null,null,null,null,8,7.53,2.06,0.86]
[null,null,"Ng =",{"$f":"VLOOKUP(D24,'MC ANALISIS INTERNO'!Q21:T68,4,TRUE)","v":16.72},null,null,null,null,null,null,null,null,null,null,null,null,9,7.92,2.25,1.03]
{"$rows_left_out":103}
{"sheet":"REVISION","index":9,"n_rows":85,"n_cols":6,"rows_kept":85,"cut":false,"hidden":false,"merged":[[84,3,85,11],[0,3,1,9],[2,3,3,9],[38,3,40,11],[22,3,24,11],[72,3,74,11],[54,3,61,11]]}
[null,null,null,"METODOLOGÍA PARA DISEÑOS DE MUROS MECANICAMENTE ESTABILIZADOS"]
[]
[null,null,null,"MUROS CON RELLENOS HORIZONTALES"]
[]
[]
[]
[]
[]
[]
[]
["Revisión de Factores de seguridad mínimos para los análisis de estabilidad externa e interna."]
[]
["Condiciones para el análisis de estabilidad externa."]
[null,"Condición de excentricidad \"e\":"]
[]
[]
[]
[null,null,"si :","e =",{"$f":"'MC ANALISIS EXTERNO'!D182","v":0.46326948523214573},"m"]
[]
[null,null,null,null,{"$f":"'MC ANALISIS EXTERNO'!$D$188","v":0.71666666666666667},"m"]
[]
[null,null,"entonces:"]
[null,null,null,{"$f":"'MC ANALISIS EXTERNO'!F188","v":"CUMPLE CONDICIÓN DE EXCENTRICIDAD"}]
[]
[]
[]
[null,"Condición del Factor de Seguridad por deslizamiento del muro \"F.S.des\":"]
[]
[]
[]
{"$rows_left_out":56}
{"sheet":"DISEÑO","index":10,"n_rows":134,"n_cols":14,"rows_kept":134,"cut":false,"hidden":false,"merged":[[0,3,1,9],[2,3,3,9],[10,4,10,9],[11,4,11,9],[133,0,136,13]]}
[null,null,null,"METODOLOGÍA PARA DISEÑOS DE MUROS MECANICAMENTE ESTABILIZADOS"]
[]
[null,null,null,"MUROS CON RELLENOS HORIZONTALES"]
[]
[]
[]
[]
[]
[]
[]
[null,null,null,null,"DISEÑO"]
[null,null,null,null,"LONGITUD REQUERIDA DE GEOSINTETICO"]
[]
["a) Longitud necesaria de empotramiento para evitar la falla por extracción "]
[]
[]
[]
[]
[null,"Donde:"]
[null,"C =",{"$f":"'PROPIEDADES DEL GEOSINTETICO'!B13","v":2}]
[null,"Ci =",{"$f":"'PROPIEDADES DEL GEOSINTETICO'!B15","v":0.66}]
[null,"Zi =","Profundidad a la que se encuentra el refuerzo"]
[null,null,null,"si: ","b =",{"$f":"'PROPIEDADES DEL GEOSINTETICO'!D19","v":1},"m"]
[null,null,null,null,"Sh =",{"$f":"'PROPIEDADES DEL GEOSINTETICO'!D21","v":1},"m"]
[null,"Rc =",{"$f":"F23/F24","v":1}]
[null,"α =",{"$f":"'PROPIEDADES DEL GEOSINTETICO'!B25","v":0.8},{"$f":"IF(C26='PROPIEDADES DEL GEOSINTETICO'!B25,\"Geomalla\",\"Geotextil\")","v":"Geomalla"}]
[]
["Capa No.","Zi (m)","Le (m)","Le (final,m)",null,"Capa No.","Zi (m)","Le (m)","Le (final,m)",null,"Capa No.","Zi (m)","Le (m)","Le (final,m)"]
[1,{"$f":"'MC ANALISIS INTERNO'!B103","v":0.5},{"$f":"IF(A29<='MC ANALISIS INTERNO'!$F$100,((1.5*'MC ANALISIS INTERNO'!D103))/($C$20*TAN(RADIANS('PROPIEDADES DE LOS SUELOS'!$C$26))*$C$21*'PROPIEDADES DE LOS SUELOS'!$C$24*B29*$C$25*$C$26),\"\")","v":1.549077426802973},{"$f":"IF(C29<=1,1,C29)","v":1.549077426802973},null,31,{"$f":"'MC ANALISIS INTERNO'!G103","v":""},{"$f":"IF(F29<='MC ANALISIS INTERNO'!$F$100,((1.5*'MC ANALISIS INTERNO'!H103))/($C$20*TAN(RADIANS('PROPIEDADES DE LOS SUELOS'!$C$26))*$C$21*'PROPIEDADES DE LOS SUELOS'!$C$24*G29*$C$25*$C$26),\"\")","v":""},{"$f":"IF(H29<=1,1,H29)","v":""},null,61,{"$f":"'MC ANALISIS INTERNO'!L103","v":""},{"$f":"IF(K29<='MC ANALISIS INTERNO'!$F$100,((1.5*'MC ANALISIS INTERNO'!L103))/($C$20*TAN(RADIANS('PROPIEDADES DE LOS SUELOS'!$C$26))*$C$21*'PROPIEDADES DE LOS SUELOS'!$C$24*L29*$C$25*$C$26),\"\")","v":""},{"$f":"IF(M29<=1,1,M29)","v":""}]
[2,{"$f":"'MC ANALISIS INTERNO'!B104","v":1},{"$f":"IF(A30<='MC ANALISIS INTERNO'!$F$100,((1.5*'MC ANALISIS INTERNO'!D104))/($C$20*TAN(RADIANS('PROPIEDADES DE LOS SUELOS'!$C$26))*$C$21*'PROPIEDADES DE LOS SUELOS'!$C$24*B30*$C$25*$C$26),\"\")","v":0.97956366694893893},{"$f":"IF(C30<=1,1,C30)","v":1},null,32,{"$f":"'MC ANALISIS INTERNO'!G104","v":""},{"$f":"IF(F30<='MC ANALISIS INTERNO'!$F$100,((1.5*'MC ANALISIS INTERNO'!H104))/($C$20*TAN(RADIANS('PROPIEDADES DE LOS SUELOS'!$C$26))*$C$21*'PROPIEDADES DE LOS SUELOS'!$C$24*G30*$C$25*$C$26),\"\")","v":""},{"$f":"IF(H30<=1,1,H30)","v":""},null,62,{"$f":"'MC ANALISIS INTERNO'!L104","v":""},{"$f":"IF(K30<='MC ANALISIS INTERNO'!$F$100,((1.5*'MC ANALISIS INTERNO'!L104))/($C$20*TAN(RADIANS('PROPIEDADES DE LOS SUELOS'!$C$26))*$C$21*'PROPIEDADES DE LOS SUELOS'!$C$24*L30*$C$25*$C$26),\"\")","v":""},{"$f":"IF(M30<=1,1,M30)","v":""}]
{"$rows_left_out":105}
{"sheet":"DISEÑO POR SISMO","index":11,"n_rows":74,"n_cols":17,"rows_kept":74,"cut":false,"hidden":false,"merged":[[0,3,1,9],[2,3,3,9],[10,4,10,9],[11,3,11,10]]}
[null,null,null,"METODOLOGÍA PARA DISEÑOS DE MUROS MECANICAMENTE ESTABILIZADOS"]
[]
[null,null,null,"MUROS CON RELLENOS HORIZONTALES"]
[]
[]
[]
[]
[]
[]
[]
[null,null,null,null,"DISEÑO POR SISMO"]
[null,null,null,"TENSION TOTAL GENERADA POR LA ACCIÓN DE UN SISMO"]
[]
["a) Fuerza inercial interna, debido al peso del relleno y la aceleración sísmica dentro de la zona activa."]
[]
[]
[]
[]
[null,"donde:"]
[]
[null,null,"Am = ",{"$f":"'MC ANALISIS EXTERNO'!$C$75","v":0.21760000000000002}]
[]
[]
[]
[]
[]
[null,null,"Areazona activa =",{"$f":"(('GEOMETRIA DEL MURO'!F10^2)*TAN(RADIANS(90-(45+('PROPIEDADES DE LOS SUELOS'!C26/2)))))/2","v":4.0163082801041723},"m2"]
[]
[]
[null,null,"WA =",{"$f":"D27*'PROPIEDADES DE LOS SUELOS'!C24","v":72.293549041875096},"KN/m"]
{"$rows_left_out":45}
{"sheet":"DISEÑO FINAL","index":12,"n_rows":130,"n_cols":8,"rows_kept":130,"cut":false,"hidden":false,"merged":[[0,2,1,8],[2,2,3,8],[9,3,9,8],[32,2,32,8],[22,0,27,10]]}
[null,null,"METODOLOGÍA PARA DISEÑOS DE MUROS MECANICAMENTE ESTABILIZADOS"]
[]
[null,null,"MUROS CON RELLENOS HORIZONTALES"]
[]
[]
[]
[]
[]
[]
[null,null,null,"DISEÑO FINAL"]
[]
[]
[]
[]
[]
[]
[]
[]
[]
[]
[]
[]
["NOTA: el diseño dado en la siguiente tabla esta dada mediante un espaciamiento vertical constante y un solo tipo de geosintético. Si se requiere un diseño combinando diferentes tipos de geosintético y variando los espacios que existen entre los refuerzos entonces dar click en \"Diseño Alternativo\", de lo contrario si esta de acuerdo con el diseño presentado a continuación, dar clik en \"Reporte Final\"."]
[]
[]
[]
[]
[]
[]
[]
{"$rows_left_out":101}
{"sheet":"REPORTE FINAL","index":13,"n_rows":148,"n_cols":10,"rows_kept":148,"cut":false,"hidden":false,"merged":[[12,0,12,2],[13,0,13,2],[0,1,0,6],[2,1,3,6],[12,3,12,8],[13,3,13,8],[10,0,10,8],[56,0,56,8],[16,0,16,2],[15,0,15,2],[14,0,14,2],[14,3,14,8],[15,3,15,8],[16,3,17,8]]}
[null,"METODOLOGÍA PARA DISEÑOS DE MUROS MECANICAMENTE ESTABILIZADOS"]
[]
[null,"MUROS CON RELLENOS HORIZONTALES"]
[]
[]
[]
[]
[]
[]
[]
["REPORTE DE DISEÑO DE MURO MECANICAMENTE ESTABILIZADO CON GEOSINTÉTICOS"]
[]
["NOMBRE DEL PROYECTO:",null,null,"CARRETERA MEXICO - PUEBLA"]
["NOMBRE DE LA EMPRESA:",null,null,"CIIASA"]
["NOMBRE DEL ANALISTA:",null,null,"M.I. JESUS ALBERTO GOMEZ RIVERA"]
["UBICACIÓN DEL PROYECTO:",null,null,"KM. 120+727.34 CARRETERA MEXICO PUEBLA"]
["DESCRIPCION DEL PROYECTO:",null,null,"SE HACE LA PROPUESTA DE LA ESTABILIZACION CON MUROS MECANICAMENTE ESTABILIZADOS"]
[]
[]
[]
["DATOS DE PROYECTO:"]
[null,"Altura:",{"$f":"'GEOMETRIA DEL MURO'!F10","v":3.73},{"$f":"'GEOMETRIA DEL MURO'!G10","v":"m"}]
[null,"Propiedades de los suelos:"]
[null,null,{"$f":"'PROPIEDADES DE LOS SUELOS'!B13","v":"Suelo de cimentación o de desplante:"}]
[null,null,null,"Peso especifico gc =",{"$f":"'PROPIEDADES DE LOS SUELOS'!C14","v":16.43},{"$f":"'PROPIEDADES DE LOS SUELOS'!D14","v":"KN/m3"}]
[null,null,null,"Cohesion Cc =",{"$f":"'PROPIEDADES DE LOS SUELOS'!C15","v":99},{"$f":"'PROPIEDADES DE LOS SUELOS'!D15","v":"KN/m2"}]
[null,null,null,"Coeficiente de friccion ϕc =",{"$f":"'PROPIEDADES DE LOS SUELOS'!C16","v":28},{"$f":"'PROPIEDADES DE LOS SUELOS'!D16","v":"°"}]
[null,null,{"$f":"'PROPIEDADES DE LOS SUELOS'!B18","v":"Relleno retenido:"}]
[null,null,null,"gf =",{"$f":"'PROPIEDADES DE LOS SUELOS'!C19","v":18},{"$f":"'PROPIEDADES DE LOS SUELOS'!D19","v":"KN/m3"}]
[null,null,null,"Cf =",{"$f":"'PROPIEDADES DE LOS SUELOS'!C20","v":10},{"$f":"'PROPIEDADES DE LOS SUELOS'!D20","v":"KN/m2"}]
{"$rows_left_out":119}
{"sheet":"DISEÑO ALTERNATIVO","index":14,"n_rows":170,"n_cols":15,"rows_kept":170,"cut":false,"hidden":false,"merged":[[49,0,49,14],[14,0,14,2],[14,3,15,13],[13,3,13,13],[0,2,1,8],[2,2,3,8],[9,3,9,8],[10,0,10,2],[11,0,11,2],[12,3,12,13],[11,3,11,13],[10,3,10,13],[12,0,12,2],[13,0,13,2]]}
[null,null,"METODOLOGÍA PARA DISEÑOS DE MUROS MECANICAMENTE ESTABILIZADOS"]
[]
[null,null,"MUROS CON RELLENOS HORIZONTALES"]
[]
[]
[]
[]
[]
[]
[null,null,null,"DISEÑO ALTERNATIVO"]
["NOMBRE DEL PROYECTO:",null,null,"CARRETERA MEXICO - PUEBLA"]
["NOMBRE DE LA EMPRESA:",null,null,"CIIASA"]
["NOMBRE DEL ANALISTA:",null,null,"M.I. JESUS ALBERTO GOMEZ RIVERA"]
["UBICACIÓN DEL PROYECTO:",null,null,"KM. 120+727.34 CARRETERA MEXICO PUEBLA"]
["DESCRIPCION DEL PROYECTO:",null,null,"SE HACE LA PROPUESTA DE LA ESTABILIZACION CON MUROS MECANICAMENTE ESTABILIZADOS"]
[]
["DATOS DE PROYECTO:"]
[null,"Altura:",{"$f":"'GEOMETRIA DEL MURO'!F10","v":3.73},{"$f":"'GEOMETRIA DEL MURO'!G10","v":"m"}]
[null,"Propiedades de los suelos:"]
[null,null,{"$f":"'PROPIEDADES DE LOS SUELOS'!B13","v":"Suelo de cimentación o de desplante:"}]
[null,null,null,"Peso especifico gc =",{"$f":"'PROPIEDADES DE LOS SUELOS'!C14","v":16.43},{"$f":"'PROPIEDADES DE LOS SUELOS'!D14","v":"KN/m3"}]
[null,null,null,"Cohesión Cc =",{"$f":"'PROPIEDADES DE LOS SUELOS'!C15","v":99},{"$f":"'PROPIEDADES DE LOS SUELOS'!D15","v":"KN/m2"}]
[null,null,null,"Coeficiente de fricción ϕc =",{"$f":"'PROPIEDADES DE LOS SUELOS'!C16","v":28},{"$f":"'PROPIEDADES DE LOS SUELOS'!D16","v":"°"}]
[null,null,{"$f":"'PROPIEDADES DE LOS SUELOS'!B18","v":"Relleno retenido:"}]
[null,null,null,"gf =",{"$f":"'PROPIEDADES DE LOS SUELOS'!C19","v":18},{"$f":"'PROPIEDADES DE LOS SUELOS'!D19","v":"KN/m3"}]
[null,null,null,"Cf =",{"$f":"'PROPIEDADES DE LOS SUELOS'!C20","v":10},{"$f":"'PROPIEDADES DE LOS SUELOS'!D20","v":"KN/m2"}]
[null,null,null,"ϕf =",{"$f":"'PROPIEDADES DE LOS SUELOS'!C21","v":30},{"$f":"'PROPIEDADES DE LOS SUELOS'!D21","v":"°"}]
[null,null,{"$f":"'PROPIEDADES DE LOS SUELOS'!B23","v":"Masa de suelo reforzado:"}]
[null,null,null,"gr =",{"$f":"'PROPIEDADES DE LOS SUELOS'!C24","v":18},{"$f":"'PROPIEDADES DE LOS SUELOS'!D24","v":"KN/m3"}]
[null,null,null,"Cr =",{"$f":"'PROPIEDADES DE LOS SUELOS'!C25","v":10},{"$f":"'PROPIEDADES DE LOS SUELOS'!D25","v":"KN/m2"}]
{"$rows_left_out":140}